{"text_format":"3","workbook":"xlsx","n_sheets":6,"sheets":["Calculator","Hire Matrix","Equipment","Multiple","Single","UK_PostCodes"],"not_rendered":{"images":1,"defined_names":1},"read":"whole","date_system":"1900"}

{"sheet":"Calculator","index":0,"n_rows":29,"n_cols":14,"rows_kept":29,"merged":[[14,11,14,13],[28,2,28,14]]}
{"$rows_empty":10}
[{"$nulls":5},"Active Transport Monitoring Survey"]
[]
[]
[]
[{"$nulls":7},"Deployment Postcode",null,null,"mk1",{"$f":"Single!D6","v":"Milton Keynes"}]
[]
[]
[{"$nulls":3},"UNITS",null,1,null,"Required",null,"Survey Cost",null,{"$f":"LOOKUP(F20,'Hire Matrix'!D9:D21,'Hire Matrix'!E9:E21)","v":{"v":295,"d":"£295.00"}}]
[]
[{"$nulls":3},"WEEKS",null,1,null,"Required",null,"Travel Excess",null,{"$f":"LOOKUP(Single!B6,Single!B12:B21,Single!D12:D21)","v":0},null,{"$f":"LOOKUP(Single!B6,Single!B12:B21,Single!C12:C21)","v":"ZONE 1"}]
[]
[{"$nulls":3},"Cost PU/PW",null,{"$f":"LOOKUP(Calculator!F20,'Hire Matrix'!D9:D21,'Hire Matrix'!F9:F21)","v":{"v":295,"d":"£295.00"}},{"$nulls":3},"London weighting",null,{"$f":"IF(Single!D6=\"london\",50,0)","v":0}]
[]
[{"$nulls":5},"Data Collection Regime",{"$nulls":3},"+ Data Collection",null,{"$f":"IF('Hire Matrix'!H24=-250,0,'Hire Matrix'!H24)","v":0}]
[]
[{"$nulls":9},"TOTAL COST",null,{"$f":"(L18+L20+L22+L24)","v":{"v":295,"d":"£295.00"}}]
[]
[]
[null,null,"Enter postcode of Survey Location\nSelect number of units and weeks of survey required \nSurvey & Per unit cost are auto calculated.\nSelect data collection frequency.\n\nMinimum hire period 1 week\n"]

{"sheet":"Hire Matrix","index":1,"n_rows":26,"n_cols":10,"rows_kept":26}
[]
[]
[]
[]
[]
[{"$nulls":3},{"$f":"Calculator!F18","v":1},"Unit",{"$nulls":3},"Units","Cost"]
[{"$nulls":3},"Weeks",{"$nulls":4},1,295]
[{"$nulls":3},1,{"$f":"LOOKUP(D6,I7:I15,J7:J15)","v":{"v":295,"d":"£295.00"}},{"$nulls":3},2,{"$f":"ROUNDUP((I8*$J$7)*(1-(I8/100)),-1)","v":580}]
[null,null,"Minimum Hire Period",1,{"$f":"$E$8*D9","v":{"v":295,"d":"£295.00"}},{"$f":"(E9/D9)/$D$6","v":{"v":295,"d":"£295.00"}},null,null,3,860]
[{"$nulls":3},2,{"$f":"ROUNDUP(D10*($E$8*((100-D10)/100)),-1)","v":{"v":580,"d":"£580.00"}},{"v":290,"d":"£290.00"},null,null,4,1140]
[{"$nulls":3},3,{"v":860,"d":"£860.00"},{"v":286.6666666666667,"d":"£286.67"},null,null,5,1410]
[{"$nulls":3},4,{"v":1140,"d":"£1,140.00"},{"v":285,"d":"£285.00"},null,null,6,1670]
[{"$nulls":3},5,{"v":1410,"d":"£1,410.00"},{"v":282,"d":"£282.00"},null,null,7,1930]
[{"$nulls":3},6,{"v":1670,"d":"£1,670.00"},{"v":278.3333333333333,"d":"£278.33"},null,null,8,2180]
[{"$nulls":3},7,{"v":1930,"d":"£1,930.00"},{"v":275.7142857142857,"d":"£275.71"},null,null,9,2420]
[{"$nulls":3},8,{"v":2180,"d":"£2,180.00"},{"v":272.5,"d":"£272.50"}]
[{"$nulls":3},9,{"v":2420,"d":"£2,420.00"},{"v":268.8888888888889,"d":"£268.89"}]
[{"$nulls":3},10,{"v":2660,"d":"£2,660.00"},{"v":266,"d":"£266.00"}]
[{"$nulls":3},11,{"v":2890,"d":"£2,890.00"},{"v":262.72727272727275,"d":"£262.73"}]
[{"$nulls":3},12,{"v":3120,"d":"£3,120.00"},{"v":260,"d":"£260.00"}]
[{"$nulls":3},13,{"v":3340,"d":"£3,340.00"},{"v":256.9230769230769,"d":"£256.92"}]
[]
[{"$nulls":4},"Data Collection","Total"]
[null,null,"Button",1,250,{"$f":"(D25*E24)+(D26*E24)","v":0},null,{"$f":"F24-E24","v":-250}]
[null,null,"Weeks",{"$f":"IF(D24=2,Calculator!F20,0)","v":0}]
[null,null,"Months",{"$f":"IF(D24=3,Calculator!F20/4,0)","v":0}]

{"sheet":"Equipment","index":2,"n_rows":18,"n_cols":9,"rows_kept":18,"merged":[[3,1,3,3]]}
[]
[]
[]
[null,"Eco Compact Units "]
[null,"SN","Dir/Non-Dir","Pyro Type",null,"Domain","From","To","Replacement Cost"]
[null,"P60G4015015","Non-Dir","M",{"$f":"IF(F6=\"\",1,0)","v":0},"Birmingham Cycle Revolution ","2020-12-01","2021-03-31",{"v":2500,"d":"£2,500.00"}]
[null,"P60G4015016","Non-Dir","Zoom",{"$f":"IF(F7=\"\",1,0)","v":1},{"$nulls":3},{"v":3000,"d":"£3,000.00"}]
[null,"P60G4015013","Non-Dir","M",0,"Birmingham Cycle Revolution ","2020-12-01","2021-03-31",{"v":2500,"d":"£2,500.00"}]
[null,"XPH15108587","Non-Dir","Zoom",1,{"$nulls":3},{"v":3000,"d":"£3,000.00"}]
[null,"P60G4035405","Non-Dir","Zoom",1,{"$nulls":3},{"v":3000,"d":"£3,000.00"}]
[null,"XPH15108586","Non-Dir","Zoom",1,{"$nulls":3},{"v":3000,"d":"£3,000.00"}]
[null,"XPH16039453","Non-Dir","M",1,{"$nulls":3},{"v":2500,"d":"£2,500.00"}]
[null,"XPH18106657","Dir","Short",1,{"$nulls":3},{"v":2025,"d":"£2,025.00"}]
[null,"ECO10104250/10","Dir","M",1,{"$nulls":3},{"v":2500,"d":"£2,500.00"}]
[null,"Eco10104254/10","Non-Dir","Short",1,{"$nulls":3},{"v":2025,"d":"£2,025.00"}]
[null,"P60G3063862","Non-Dir","M",1,{"$nulls":3},{"v":2500,"d":"£2,500.00"}]
[]
[{"$nulls":3},"For Hire",{"$f":"SUM(E6:E17)","v":9},null,null,"Ave Replacment cost",{"$f":"AVERAGE(I6:I16)*0.75","v":{"v":1946.590909090909,"d":"£1,946.59"}}]

{"sheet":"Multiple","index":3,"n_rows":20,"n_cols":7,"rows_kept":20}
["Multiple UK Postcode distances"]
[]
["PostCode_1","PostCode_2","Lat_1","Long_1","Lat_2","Long_2","Distance (miles)"]
["WA1","SW14",{"$f":"IF(A4=\"\",\"\",IF(ISNA(VLOOKUP(A4,UK_PostCodes!A$2:D$2824,1,0)),\"\",VLOOKUP(A4,UK_PostCodes!A$2:D$2824,3,0)))","v":53.394},{"$f":"IF(A4=\"\",\"\",VLOOKUP(A4,UK_PostCodes!A$2:D$2824,4,0))","v":-2.569},{"$f":"IF(B4=\"\",\"\",IF(ISNA(VLOOKUP(B4,UK_PostCodes!A$2:D$2824,1,0)),\"\",VLOOKUP(B4,UK_PostCodes!A$2:D$2824,3,0)))","v":51.465},{"$f":"IF(B4=\"\",\"\",VLOOKUP(B4,UK_PostCodes!A$2:D$2824,4,0))","v":-0.265},{"$f":"IF(COUNTIF(A4:F4,\"?*\")=0,\"\",3960*ACOS(COS(RADIANS(90-C4))*COS(RADIANS(90-E4))+SIN(RADIANS(90-C4))*SIN(RADIANS(90-E4))*COS(RADIANS(D4-F4))))","v":{"v":164.9129157312647,"d":"164.91"}}]
["WA1","IP11",{"$f":"IF(A5=\"\",\"\",IF(ISNA(VLOOKUP(A5,UK_PostCodes!A$2:D$2824,1,0)),\"\",VLOOKUP(A5,UK_PostCodes!A$2:D$2824,3,0)))","v":53.394},{"$f":"IF(A5=\"\",\"\",VLOOKUP(A5,UK_PostCodes!A$2:D$2824,4,0))","v":-2.569},{"$f":"IF(B5=\"\",\"\",IF(ISNA(VLOOKUP(B5,UK_PostCodes!A$2:D$2824,1,0)),\"\",VLOOKUP(B5,UK_PostCodes!A$2:D$2824,3,0)))","v":51.97},{"$f":"IF(B5=\"\",\"\",VLOOKUP(B5,UK_PostCodes!A$2:D$2824,4,0))","v":1.334},{"v":190.82869895606697,"d":"190.83"}]
["WA1","BT7",{"$f":"IF(A6=\"\",\"\",IF(ISNA(VLOOKUP(A6,UK_PostCodes!A$2:D$2824,1,0)),\"\",VLOOKUP(A6,UK_PostCodes!A$2:D$2824,3,0)))","v":53.394},{"$f":"IF(A6=\"\",\"\",VLOOKUP(A6,UK_PostCodes!A$2:D$2824,4,0))","v":-2.569},{"$f":"IF(B6=\"\",\"\",IF(ISNA(VLOOKUP(B6,UK_PostCodes!A$2:D$2824,1,0)),\"\",VLOOKUP(B6,UK_PostCodes!A$2:D$2824,3,0)))","v":54.582},{"$f":"IF(B6=\"\",\"\",VLOOKUP(B6,UK_PostCodes!A$2:D$2824,4,0))","v":-5.924},{"v":159.12660745354844,"d":"159.13"}]
["WA1","WA15",{"$f":"IF(A7=\"\",\"\",IF(ISNA(VLOOKUP(A7,UK_PostCodes!A$2:D$2824,1,0)),\"\",VLOOKUP(A7,UK_PostCodes!A$2:D$2824,3,0)))","v":53.394},{"$f":"IF(A7=\"\",\"\",VLOOKUP(A7,UK_PostCodes!A$2:D$2824,4,0))","v":-2.569},{"$f":"IF(B7=\"\",\"\",IF(ISNA(VLOOKUP(B7,UK_PostCodes!A$2:D$2824,1,0)),\"\",VLOOKUP(B7,UK_PostCodes!A$2:D$2824,3,0)))","v":53.384},{"$f":"IF(B7=\"\",\"\",VLOOKUP(B7,UK_PostCodes!A$2:D$2824,4,0))","v":-2.325},{"v":10.081091964178288,"d":"10.08"}]
["WA1","SE8",{"$f":"IF(A8=\"\",\"\",IF(ISNA(VLOOKUP(A8,UK_PostCodes!A$2:D$2824,1,0)),\"\",VLOOKUP(A8,UK_PostCodes!A$2:D$2824,3,0)))","v":53.394},{"$f":"IF(A8=\"\",\"\",VLOOKUP(A8,UK_PostCodes!A$2:D$2824,4,0))","v":-2.569},{"$f":"IF(B8=\"\",\"\",IF(ISNA(VLOOKUP(B8,UK_PostCodes!A$2:D$2824,1,0)),\"\",VLOOKUP(B8,UK_PostCodes!A$2:D$2824,3,0)))","v":51.481},{"$f":"IF(B8=\"\",\"\",VLOOKUP(B8,UK_PostCodes!A$2:D$2824,4,0))","v":-0.028},{"v":170.10666848983598,"d":"170.11"}]
["WA1","WA4",{"$f":"IF(A9=\"\",\"\",IF(ISNA(VLOOKUP(A9,UK_PostCodes!A$2:D$2824,1,0)),\"\",VLOOKUP(A9,UK_PostCodes!A$2:D$2824,3,0)))","v":53.394},{"$f":"IF(A9=\"\",\"\",VLOOKUP(A9,UK_PostCodes!A$2:D$2824,4,0))","v":-2.569},{"$f":"IF(B9=\"\",\"\",IF(ISNA(VLOOKUP(B9,UK_PostCodes!A$2:D$2824,1,0)),\"\",VLOOKUP(B9,UK_PostCodes!A$2:D$2824,3,0)))","v":53.365},{"$f":"IF(B9=\"\",\"\",VLOOKUP(B9,UK_PostCodes!A$2:D$2824,4,0))","v":-2.574},{"v":2.014908645873188,"d":"2.01"}]
[null,null,{"$f":"IF(A10=\"\",\"\",IF(ISNA(VLOOKUP(A10,UK_PostCodes!A$2:D$2824,1,0)),\"\",VLOOKUP(A10,UK_PostCodes!A$2:D$2824,3,0)))","v":""},{"$f":"IF(A10=\"\",\"\",VLOOKUP(A10,UK_PostCodes!A$2:D$2824,4,0))","v":""},{"$f":"IF(B10=\"\",\"\",IF(ISNA(VLOOKUP(B10,UK_PostCodes!A$2:D$2824,1,0)),\"\",VLOOKUP(B10,UK_PostCodes!A$2:D$2824,3,0)))","v":""},{"$f":"IF(B10=\"\",\"\",VLOOKUP(B10,UK_PostCodes!A$2:D$2824,4,0))","v":""},""]
[null,null,{"$f":"IF(A11=\"\",\"\",IF(ISNA(VLOOKUP(A11,UK_PostCodes!A$2:D$2824,1,0)),\"\",VLOOKUP(A11,UK_PostCodes!A$2:D$2824,3,0)))","v":""},{"$f":"IF(A11=\"\",\"\",VLOOKUP(A11,UK_PostCodes!A$2:D$2824,4,0))","v":""},{"$f":"IF(B11=\"\",\"\",IF(ISNA(VLOOKUP(B11,UK_PostCodes!A$2:D$2824,1,0)),\"\",VLOOKUP(B11,UK_PostCodes!A$2:D$2824,3,0)))","v":""},{"$f":"IF(B11=\"\",\"\",VLOOKUP(B11,UK_PostCodes!A$2:D$2824,4,0))","v":""},""]
[null,null,{"$f":"IF(A12=\"\",\"\",IF(ISNA(VLOOKUP(A12,UK_PostCodes!A$2:D$2824,1,0)),\"\",VLOOKUP(A12,UK_PostCodes!A$2:D$2824,3,0)))","v":""},{"$f":"IF(A12=\"\",\"\",VLOOKUP(A12,UK_PostCodes!A$2:D$2824,4,0))","v":""},{"$f":"IF(B12=\"\",\"\",IF(ISNA(VLOOKUP(B12,UK_PostCodes!A$2:D$2824,1,0)),\"\",VLOOKUP(B12,UK_PostCodes!A$2:D$2824,3,0)))","v":""},{"$f":"IF(B12=\"\",\"\",VLOOKUP(B12,UK_PostCodes!A$2:D$2824,4,0))","v":""},""]
[null,null,{"$f":"IF(A13=\"\",\"\",IF(ISNA(VLOOKUP(A13,UK_PostCodes!A$2:D$2824,1,0)),\"\",VLOOKUP(A13,UK_PostCodes!A$2:D$2824,3,0)))","v":""},{"$f":"IF(A13=\"\",\"\",VLOOKUP(A13,UK_PostCodes!A$2:D$2824,4,0))","v":""},{"$f":"IF(B13=\"\",\"\",IF(ISNA(VLOOKUP(B13,UK_PostCodes!A$2:D$2824,1,0)),\"\",VLOOKUP(B13,UK_PostCodes!A$2:D$2824,3,0)))","v":""},{"$f":"IF(B13=\"\",\"\",VLOOKUP(B13,UK_PostCodes!A$2:D$2824,4,0))","v":""},""]
[null,null,{"$f":"IF(A14=\"\",\"\",IF(ISNA(VLOOKUP(A14,UK_PostCodes!A$2:D$2824,1,0)),\"\",VLOOKUP(A14,UK_PostCodes!A$2:D$2824,3,0)))","v":""},{"$f":"IF(A14=\"\",\"\",VLOOKUP(A14,UK_PostCodes!A$2:D$2824,4,0))","v":""},{"$f":"IF(B14=\"\",\"\",IF(ISNA(VLOOKUP(B14,UK_PostCodes!A$2:D$2824,1,0)),\"\",VLOOKUP(B14,UK_PostCodes!A$2:D$2824,3,0)))","v":""},{"$f":"IF(B14=\"\",\"\",VLOOKUP(B14,UK_PostCodes!A$2:D$2824,4,0))","v":""},""]
[null,null,{"$f":"IF(A15=\"\",\"\",IF(ISNA(VLOOKUP(A15,UK_PostCodes!A$2:D$2824,1,0)),\"\",VLOOKUP(A15,UK_PostCodes!A$2:D$2824,3,0)))","v":""},{"$f":"IF(A15=\"\",\"\",VLOOKUP(A15,UK_PostCodes!A$2:D$2824,4,0))","v":""},{"$f":"IF(B15=\"\",\"\",IF(ISNA(VLOOKUP(B15,UK_PostCodes!A$2:D$2824,1,0)),\"\",VLOOKUP(B15,UK_PostCodes!A$2:D$2824,3,0)))","v":""},{"$f":"IF(B15=\"\",\"\",VLOOKUP(B15,UK_PostCodes!A$2:D$2824,4,0))","v":""},""]
[null,null,{"$f":"IF(A16=\"\",\"\",IF(ISNA(VLOOKUP(A16,UK_PostCodes!A$2:D$2824,1,0)),\"\",VLOOKUP(A16,UK_PostCodes!A$2:D$2824,3,0)))","v":""},{"$f":"IF(A16=\"\",\"\",VLOOKUP(A16,UK_PostCodes!A$2:D$2824,4,0))","v":""},{"$f":"IF(B16=\"\",\"\",IF(ISNA(VLOOKUP(B16,UK_PostCodes!A$2:D$2824,1,0)),\"\",VLOOKUP(B16,UK_PostCodes!A$2:D$2824,3,0)))","v":""},{"$f":"IF(B16=\"\",\"\",VLOOKUP(B16,UK_PostCodes!A$2:D$2824,4,0))","v":""},""]
[null,null,{"$f":"IF(A17=\"\",\"\",IF(ISNA(VLOOKUP(A17,UK_PostCodes!A$2:D$2824,1,0)),\"\",VLOOKUP(A17,UK_PostCodes!A$2:D$2824,3,0)))","v":""},{"$f":"IF(A17=\"\",\"\",VLOOKUP(A17,UK_PostCodes!A$2:D$2824,4,0))","v":""},{"$f":"IF(B17=\"\",\"\",IF(ISNA(VLOOKUP(B17,UK_PostCodes!A$2:D$2824,1,0)),\"\",VLOOKUP(B17,UK_PostCodes!A$2:D$2824,3,0)))","v":""},{"$f":"IF(B17=\"\",\"\",VLOOKUP(B17,UK_PostCodes!A$2:D$2824,4,0))","v":""},""]
[null,null,{"$f":"IF(A18=\"\",\"\",IF(ISNA(VLOOKUP(A18,UK_PostCodes!A$2:D$2824,1,0)),\"\",VLOOKUP(A18,UK_PostCodes!A$2:D$2824,3,0)))","v":""},{"$f":"IF(A18=\"\",\"\",VLOOKUP(A18,UK_PostCodes!A$2:D$2824,4,0))","v":""},{"$f":"IF(B18=\"\",\"\",IF(ISNA(VLOOKUP(B18,UK_PostCodes!A$2:D$2824,1,0)),\"\",VLOOKUP(B18,UK_PostCodes!A$2:D$2824,3,0)))","v":""},{"$f":"IF(B18=\"\",\"\",VLOOKUP(B18,UK_PostCodes!A$2:D$2824,4,0))","v":""},""]
[null,null,{"$f":"IF(A19=\"\",\"\",IF(ISNA(VLOOKUP(A19,UK_PostCodes!A$2:D$2824,1,0)),\"\",VLOOKUP(A19,UK_PostCodes!A$2:D$2824,3,0)))","v":""},{"$f":"IF(A19=\"\",\"\",VLOOKUP(A19,UK_PostCodes!A$2:D$2824,4,0))","v":""},{"$f":"IF(B19=\"\",\"\",IF(ISNA(VLOOKUP(B19,UK_PostCodes!A$2:D$2824,1,0)),\"\",VLOOKUP(B19,UK_PostCodes!A$2:D$2824,3,0)))","v":""},{"$f":"IF(B19=\"\",\"\",VLOOKUP(B19,UK_PostCodes!A$2:D$2824,4,0))","v":""},""]
[null,null,{"$f":"IF(A20=\"\",\"\",IF(ISNA(VLOOKUP(A20,UK_PostCodes!A$2:D$2824,1,0)),\"\",VLOOKUP(A20,UK_PostCodes!A$2:D$2824,3,0)))","v":""},{"$f":"IF(A20=\"\",\"\",VLOOKUP(A20,UK_PostCodes!A$2:D$2824,4,0))","v":""},{"$f":"IF(B20=\"\",\"\",IF(ISNA(VLOOKUP(B20,UK_PostCodes!A$2:D$2824,1,0)),\"\",VLOOKUP(B20,UK_PostCodes!A$2:D$2824,3,0)))","v":""},{"$f":"IF(B20=\"\",\"\",VLOOKUP(B20,UK_PostCodes!A$2:D$2824,4,0))","v":""},""]

{"sheet":"Single","index":4,"n_rows":21,"n_cols":5,"rows_kept":21}
["Single UK Postcode distances"]
[]
["Enter PostCode 1","nn12",{"$f":"IF(B3=\"\",\"\",IF(ISNA(VLOOKUP(B3,UK_PostCodes!A$2:D$2824,1,0)),\"\",VLOOKUP(B3,UK_PostCodes!A$2:D$2824,3,0)))","v":52.128},{"$f":"IF(B3=\"\",\"\",VLOOKUP(B3,UK_PostCodes!A$2:D$2824,4,0))","v":-0.998}]
["Enter PostCode 2",{"$f":"Calculator!K15","v":"mk1"},{"$f":"IF(B4=\"\",\"\",IF(ISNA(VLOOKUP(B4,UK_PostCodes!A$2:D$2824,1,0)),\"\",VLOOKUP(B4,UK_PostCodes!A$2:D$2824,3,0)))","v":52.005},{"$f":"IF(B4=\"\",\"\",VLOOKUP(B4,UK_PostCodes!A$2:D$2824,4,0))","v":-0.726}]
[]
["Distance between =",{"$f":"(3960*ACOS(COS(RADIANS(90-C3))*COS(RADIANS(90-C4))+SIN(RADIANS(90-C3))*SIN(RADIANS(90-C4))*COS(RADIANS(D3-D4))))+25","v":{"v":39.34672955691742,"d":"39.35"}},"miles",{"$f":"LOOKUP(B4,UK_PostCodes!A2:A2824,UK_PostCodes!B2:B2824)","v":"Milton Keynes"},"Plus 25mies added for non liniar"]
[]
[]
[]
[]
[]
[null,0,"ZONE 1",0]
[null,50,"ZONE 2",50]
[null,100,"ZONE 3",170]
[null,150,"ZONE 4",{"$f":"D14+((B15-B14)*1.5)","v":245}]
[null,200,"ZONE 5",320]
[null,250,"ZONE 6",395]
[null,300,"ZONE 7",470]
[null,350,"ZONE 8",545]
[null,400,"ZONE 9",620]
[null,450,"ZONE 10",695]

{"sheet":"UK_PostCodes","index":5,"n_rows":2824,"n_cols":4,"rows_kept":2824}
["PostCode","County or Area","Latitude","Longitude"]
["AB10","Aberdeen",57.135,-2.117]
["AB11","Aberdeen",57.138,-2.092]
["AB12","Aberdeen",57.101,-2.111]
["AB13","Aberdeen",57.108,-2.237]
["AB14","Aberdeen",57.101,-2.27]
["AB15","Aberdeen",57.138,-2.164]
["AB16","Aberdeen",57.161,-2.156]
["AB21","Aberdeen",57.21,-2.2]
["AB22","Aberdeen",57.187,-2.119]
["AB23","Aberdeen",57.212,-2.088]
["AB25","Aberdeen",57.153,-2.112]
["AB30","Aberdeen",56.847,-2.477]
["AB31","Aberdeen",57.074,-2.527]
["AB32","Aberdeen",57.156,-2.317]
["AB33","Aberdeen",57.225,-2.741]
["AB34","Aberdeen",57.094,-2.812]
["AB35","Aberdeen",57.038,-3.149]
["AB36","Aberdeen",57.197,-3.067]
["AB37","Aberdeen",57.331,-3.351]
["AB38","Aberdeen",57.486,-3.225]
["AB39","Aberdeen",56.978,-2.217]
["AB41","Aberdeen",57.376,-2.105]
["AB42","Aberdeen",57.501,-1.888]
["AB43","Aberdeen",57.658,-2.043]
["AB44","Aberdeen",57.669,-2.492]
["AB45","Aberdeen",57.651,-2.566]
["AB51","Aberdeen",57.289,-2.405]
["AB52","Aberdeen",57.344,-2.607]
["AB53","Aberdeen",57.525,-2.393]
["AB54","Aberdeen",57.454,-2.763]
["AB55","Aberdeen",57.524,-2.99]
["AB56","Aberdeen",57.675,-2.926]
["AL1","St. Albans",51.748,-0.322]
["AL10","St. Albans",51.76,-0.23]
["AL2","St. Albans",51.72,-0.333]
["AL3","St. Albans",51.778,-0.37]
["AL4","St. Albans",51.772,-0.294]
["AL5","St. Albans",51.816,-0.351]
["AL6","St. Albans",51.831,-0.197]
["AL7","St. Albans",51.797,-0.186]
["AL8","St. Albans",51.803,-0.209]
["AL9","St. Albans",51.745,-0.199]
["B1","Birmingham",52.478,-1.907]
["B10","Birmingham",52.47,-1.851]
["B11","Birmingham",52.454,-1.858]
["B12","Birmingham",52.46,-1.882]
["B13","Birmingham",52.437,-1.878]
["B14","Birmingham",52.417,-1.889]
["B15","Birmingham",52.467,-1.924]
["B16","Birmingham",52.476,-1.933]
["B17","Birmingham",52.461,-1.961]
["B18","Birmingham",52.491,-1.924]
["B19","Birmingham",52.496,-1.905]
["B2","Birmingham",52.479,-1.897]
["B20","Birmingham",52.514,-1.918]
["B21","Birmingham",52.506,-1.939]
["B23","Birmingham",52.528,-1.854]
["B24","Birmingham",52.519,-1.827]
["B25","Birmingham",52.465,-1.82]
["B26","Birmingham",52.461,-1.79]
["B27","Birmingham",52.445,-1.822]
["B28","Birmingham",52.427,-1.842]
["B29","Birmingham",52.437,-1.947]
["B3","Birmingham",52.48,-1.902]
["B30","Birmingham",52.422,-1.927]
["B31","Birmingham",52.408,-1.972]
["B32","Birmingham",52.448,-1.993]
["B33","Birmingham",52.48,-1.787]
["B34","Birmingham",52.496,-1.781]
["B35","Birmingham",52.519,-1.788]
["B36","Birmingham",52.504,-1.779]
["B37","Birmingham",52.478,-1.741]
["B38","Birmingham",52.4,-1.933]
["B4","Birmingham",52.482,-1.894]
["B40","Birmingham",52.459,-1.722]
["B42","Birmingham",52.533,-1.911]
["B43","Birmingham",52.548,-1.929]
["B44","Birmingham",52.545,-1.884]
["B45","Birmingham",52.388,-2.009]
["B46","Birmingham",52.508,-1.694]
["B47","Birmingham",52.387,-1.88]
["B48","Birmingham",52.355,-1.948]
["B49","Birmingham",52.217,-1.867]
["B5","Birmingham",52.47,-1.896]
["B50","Birmingham",52.169,-1.854]
["B6","Birmingham",52.504,-1.885]
["B60","Birmingham",52.326,-2.049]
["B61","Birmingham",52.345,-2.067]
["B62","Birmingham",52.456,-2.032]
["B63","Birmingham",52.452,-2.067]
["B64","Birmingham",52.472,-2.068]
["B65","Birmingham",52.483,-2.042]
["B66","Birmingham",52.493,-1.964]
["B67","Birmingham",52.486,-1.977]
["B68","Birmingham",52.479,-2]
["B69","Birmingham",52.502,-2.028]
["B7","Birmingham",52.493,-1.873]
["B70","Birmingham",52.52,-2.003]
["B71","Birmingham",52.535,-1.989]
["B72","Birmingham",52.552,-1.821]
["B73","Birmingham",52.552,-1.841]
["B74","Birmingham",52.583,-1.858]
["B75","Birmingham",52.578,-1.809]
["B76","Birmingham",52.545,-1.785]
["B77","Birmingham",52.618,-1.667]
["B78","Birmingham",52.606,-1.673]
["B79","Birmingham",52.65,-1.681]
["B8","Birmingham",52.49,-1.84]
["B80","Birmingham",52.277,-1.895]
["B9","Birmingham",52.478,-1.849]
["B90","Birmingham",52.4,-1.824]
["B91","Birmingham",52.413,-1.782]
["B92","Birmingham",52.436,-1.774]
["B93","Birmingham",52.38,-1.743]
["B94","Birmingham",52.351,-1.791]
["B95","Birmingham",52.285,-1.779]
["B96","Birmingham",52.252,-1.96]
["B97","Birmingham",52.299,-1.954]
["B98","Birmingham",52.303,-1.914]
["BA1","Bath",51.391,-2.36]
["BA10","Bath",51.113,-2.446]
["BA11","Bath",51.236,-2.325]
["BA12","Bath",51.171,-2.187]
["BA13","Bath",51.262,-2.179]
["BA14","Bath",51.318,-2.201]
["BA15","Bath",51.351,-2.265]
["BA16","Bath",51.125,-2.743]
["BA2","Bath",51.36,-2.377]
["BA20","Bath",50.938,-2.642]
["BA21","Bath",50.951,-2.633]
["BA22","Bath",50.968,-2.637]
["BA3","Bath",51.275,-2.473]
["BA4","Bath",51.171,-2.531]
["BA5","Bath",51.212,-2.653]
["BA6","Bath",51.141,-2.705]
["BA7","Bath",51.089,-2.518]
["BA8","Bath",50.999,-2.411]
["BA9","Bath",51.057,-2.409]
["BB1","Blackburn",53.756,-2.462]
["BB10","Blackburn",53.799,-2.219]
["BB11","Blackburn",53.783,-2.252]
["BB12","Blackburn",53.803,-2.29]
["BB18","Blackburn",53.914,-2.171]
["BB2","Blackburn",53.741,-2.5]
["BB3","Blackburn",53.698,-2.465]
["BB4","Blackburn",53.703,-2.29]
["BB5","Blackburn",53.754,-2.371]
["BB6","Blackburn",53.792,-2.417]
["BB7","Blackburn",53.874,-2.386]
["BB8","Blackburn",53.858,-2.163]
["BB9","Blackburn",53.837,-2.214]
["BD1","Bradford",53.796,-1.752]
["BD10","Bradford",53.832,-1.725]
["BD11","Bradford",53.751,-1.676]
["BD12","Bradford",53.746,-1.761]
["BD13","Bradford",53.786,-1.859]
["BD14","Bradford",53.782,-1.816]
["BD15","Bradford",53.81,-1.836]
["BD16","Bradford",53.849,-1.833]
["BD17","Bradford",53.847,-1.767]
["BD18","Bradford",53.831,-1.776]
["BD19","Bradford",53.727,-1.712]
["BD2","Bradford",53.814,-1.734]
["BD20","Bradford",53.897,-1.947]
["BD21","Bradford",53.864,-1.906]
["BD22","Bradford",53.846,-1.952]
["BD23","Bradford",53.993,-2.054]
["BD24","Bradford",54.077,-2.274]
["BD3","Bradford",53.798,-1.727]
["BD4","Bradford",53.776,-1.718]
["BD5","Bradford",53.778,-1.758]
["BD6","Bradford",53.765,-1.783]
["BD7","Bradford",53.783,-1.782]
["BD8","Bradford",53.801,-1.781]
["BD9","Bradford",53.812,-1.789]
["BH1","Bournemouth",50.724,-1.86]
["BH10","Bournemouth",50.759,-1.891]
["BH11","Bournemouth",50.761,-1.917]
["BH12","Bournemouth",50.737,-1.926]
["BH13","Bournemouth",50.71,-1.917]
["BH14","Bournemouth",50.721,-1.944]
["BH15","Bournemouth",50.722,-1.984]
["BH16","Bournemouth",50.738,-2.044]
["BH17","Bournemouth",50.746,-1.975]
["BH18","Bournemouth",50.758,-1.993]
["BH19","Bournemouth",50.611,-1.97]
["BH2","Bournemouth",50.721,-1.881]
["BH20","Bournemouth",50.686,-2.146]
["BH21","Bournemouth",50.812,-1.973]
["BH22","Bournemouth",50.805,-1.887]
["BH23","Bournemouth",50.746,-1.754]
["BH24","Bournemouth",50.844,-1.786]
["BH25","Bournemouth",50.752,-1.657]
["BH3","Bournemouth",50.735,-1.88]
["BH31","Bournemouth",50.876,-1.872]
["BH4","Bournemouth",50.721,-1.898]
["BH5","Bournemouth",50.725,-1.834]
["BH6","Bournemouth",50.727,-1.804]
["BH7","Bournemouth",50.735,-1.831]
{"$rows_left_out":2624}